ID,Title,"Start Date","Start Time","End Date","End Time",Link,Location,Organizer,"Organizer Tel","Organizer Email","Event Cost"
8412,"Zoo Idaho-Science Night Trivia",2019-05-21,"7:30 pm",2019-05-21,"9:30 pm",https://www.visitpocatello.com/events/zoo-idaho-science-night-trivia-9,,"Zoo Idaho",208-234-6264,zooidaho.org,"$15 per team"
8410,"Zoo Idaho-Science Night Trivia",2019-05-14,"7:30 pm",2019-05-14,"9:30 pm",https://www.visitpocatello.com/events/zoo-idaho-science-night-trivia-8,"305 East Lander Street, Pocatello, ID, USA","Zoo Idaho",208-234-6264,zooidaho.org,"$15 per team"
8408,"Zoo Idaho-Science Night Trivia",2019-04-16,"7:30 pm",2019-04-16,"9:30 pm",https://www.visitpocatello.com/events/zoo-idaho-science-night-trivia-7,"2720 Bannock Highway, Pocatello, ID, USA","Zoo Idaho",208-234-6264,zooidaho.org,"$15 per team"
8406,"Zoo Idaho-Science Night Trivia",2019-04-09,"7:30 pm",2019-04-09,"9:30 pm",https://www.visitpocatello.com/events/zoo-idaho-science-night-trivia-6,"305 East Lander Street, Pocatello, ID, USA","Zoo Idaho",208-234-6264,zooidaho.org,"$15 per team"
8404,"Zoo Idaho-Climate Series",2019-03-28,"5:00 pm",2019-03-28,"6:30 pm",https://www.visitpocatello.com/events/zoo-idaho-climate-series-4,"Zoo Idaho, South 2nd Avenue, Pocatello, ID, USA","Zoo Idaho",208-234-6264,zooidaho.org,$10
8402,"Zoo Idaho-Climate Series",2019-03-21,"5:00 pm",2019-03-21,"6:30 pm",https://www.visitpocatello.com/events/zoo-idaho-climate-series-3,"Zoo Idaho, South 2nd Avenue, Pocatello, ID, USA","Zoo Idaho",208-234-6264,zooidaho.org,"$15 per team"
8400,"Zoo Idaho-Science Night Trivia",2019-03-19,"7:30 pm",2019-03-19,"9:30 pm",https://www.visitpocatello.com/events/zoo-idaho-science-night-trivia-5,"2720 Bannock Highway, Pocatello, ID, USA","Zoo Idaho",208-234-6264,zooidaho.org,"$15 per team"
8398,"Zoo Idaho-Climate Series",2019-03-14,"5:00 pm",2019-03-14,"6:30 pm",https://www.visitpocatello.com/events/zoo-idaho-climate-series-2,"Zoo Idaho, South 2nd Avenue, Pocatello, ID, USA","Zoo Idaho",208-234-6264,zooidaho.org,$10
8396,"Zoo Idaho-Science Night Trivia",2019-03-12,"7:30 pm",2018-03-12,"9:30 pm",https://www.visitpocatello.com/events/zoo-idaho-science-night-trivia-4,"305 East Lander Street, Pocatello, ID, USA","Zoo Idaho",208-234-6264,zooidaho.org,"$15 per team"
8394,"Zoo Idaho-Climate Series",2019-03-07,"5:00 pm",2019-03-07,"6:30 pm",https://www.visitpocatello.com/events/zoo-idaho-climate-series,"Zoo Idaho, South 2nd Avenue, Pocatello, ID, USA","Zoo Idaho",208-234-6264,zooidaho.org,$10
8392,"Sunday Snowshoe and Wine Club",2019-03-03,"12:00 pm",2019-03-03,"4:00 pm",https://www.visitpocatello.com/events/sunday-snowshoe-and-wine-club-3,"East Mink Creek Nordic Center, South 2nd Avenue, Pocatello, ID, USA","Pocatello Community Recreation Center",208-234-6237,,$5-$12
8390,"Zoo Idaho-Science Night Trivia",2019-02-19,"7:30 pm",2019-02-19,"9:30 pm",https://www.visitpocatello.com/events/zoo-idaho-science-night-trivia-3,"2720 Bannock Highway, Pocatello, ID, USA","Zoo Idaho",208-234-6264,zooidaho.org,"$15 per team"
8386,"Zoo Idaho-Science Night Trivia",2019-02-12,"7:30 pm",2019-02-12,"9:00 pm",https://www.visitpocatello.com/events/zoo-idaho-science-night-trivia-2,"305 East Lander Street, Pocatello, ID, USA","Zoo Idaho",208-234-6264,zooidaho.org,"$15 per team"
8383,"KidZ Only Winter SnooZzzz",2019-02-08,"6:30 pm",2019-02-09,"9:00 am",https://www.visitpocatello.com/events/kidz-only-winter-snoozzzz,"Zoo Idaho, South 2nd Avenue, Pocatello, ID, USA","Zoo Idaho",208-234-6264,zooidaho.org,$50
8377,"Sunday Snowshoe and Wine Club",2019-02-03,"12:00 pm",2019-02-03,"4:00 pm",https://www.visitpocatello.com/events/sunday-snowshoe-and-wine-club-2,"East Mink Creek Nordic Center, South 2nd Avenue, Pocatello, ID, USA","Pocatello Community Recreation Center",208-234-6237,,$5-$12
8373,"Youth Saturday Ski Classes",2018-12-22,"10:30 am",2019-12-22,"4:00 pm",https://www.visitpocatello.com/events/saturday-ski-classes,"East Mink Creek Nordic Center, South 2nd Avenue, Pocatello, ID, USA","Pocatello Community Recreation Center",208-234-6237,,$48
8367,"Zoo Idaho Science Night Trivia at The Sand Trap",2019-01-15,"7:30 pm",2019-01-15,"9:30 pm",https://www.visitpocatello.com/events/zoo-idaho-science-night-trivia-at-the-sand-trap,"2720 Bannock Highway, Pocatello, ID, USA","Zoo Idaho",208-234-6264,zooidaho.org,"$15 per team"
8359,"Zoo Idaho-Science Night Trivia at Jim Dandy Brewing",2019-01-08,"7:30 pm",2019-01-08,"9:30 pm",https://www.visitpocatello.com/events/zoo-idaho-science-night-trivia,"305 East Lander Street, Pocatello, ID, USA","Zoo Idaho",208-234-6264,zooidaho.org,"$15 per team"
8356,"Sunday Snowshoe and Wine Club",2019-01-13,"12:00 pm",2019-01-13,"4:00 pm",https://www.visitpocatello.com/events/sunday-snowshoe-and-wine-club,"East Mink Creek Nordic Center, South 2nd Avenue, Pocatello, ID, USA","Pocatello Community Recreation Center",208-234-6237,,$5-$12
8354,"Women&#8217;s Winter Lesson Series, Nordic Skiing &#038; Skate Skiing",2019-01-12,"10:00 am",2019-01-19,"2:30 pm",https://www.visitpocatello.com/events/womens-winter-lesson-series-nordic-skiing-skate-skiing,"East Mink Creek Nordic Center, South 2nd Avenue, Pocatello, ID, USA","Pocatello Community Recreation Center",208-234-6237,,$25-$80
8351,"Ski for Free Day, East Fork Mink Creek Nordic Center",2019-01-05,"9:00 am",2019-01-05,"5:00 pm",https://www.visitpocatello.com/events/ski-for-free-day,"East Mink Creek Nordic Center, South 2nd Avenue, Pocatello, ID, USA","Pocatello Community Recreation Center",208-234-6237,,FREE
8348,"Holiday Hoopla, sponsored by Pocatello Community Recreation Center",2018-12-22,"2:00 pm",2018-12-22,"4:00 pm",https://www.visitpocatello.com/events/holiday-hoopla-pocatello-community-recreation-center,"Pocatello, ID, USA",,,,$3
8346,"Men&#8217;s Basketball, Idaho State University vs. Sacramento State Hornets",2019-01-31,"7:05 pm",2019-01-31,,https://www.visitpocatello.com/events/mens-basketball-idaho-state-university-vs-sacramento-state-hornets,"ISU Holt Arena, Pocatello, ID, USA",,,,$10-$17
8338,"Men&#8217;s Basketball, Idaho State University vs Northern Colorado Bears",2019-01-21,"7:05 pm",2019-01-21,,https://www.visitpocatello.com/events/isu-mens-basketball-vs-northern-colorado-bears,"Pocatello, ID, USA",,,,$10-$17
8336,"Men&#8217;s Basketball, Idaho State University vs. Northern Arizona Lumberjacks",2019-01-05,"7:05 pm",2019-01-05,,https://www.visitpocatello.com/events/idaho-state-university-mens-basketball-2019,"ISU Holt Arena, Pocatello, ID, USA",,,,$10-$17
8334,"Men&#8217;s Basketball, Idaho State University vs. Southern Utah",2019-01-03,"7:05 pm",2019-01-03,,https://www.visitpocatello.com/events/mens-basketball-idaho-state-university-vs-southern-utah,"Pocatello, ID, USA",,,,$10-$17
8325,"Season Finale: Celebration of Idaho",2019-04-26,"7:30 pm",2019-04-26,,https://www.visitpocatello.com/events/season-finale-celebration-of-idaho,"Pocatello, ID, USA","ISU Symphony",208-234-1587,symphony@isu.edu,$13-$40
8323,"Youth Orchestra Spring Concert",2019-04-17,"7:30 pm",2019-04-17,,https://www.visitpocatello.com/events/youth-orchestra-spring-concert,"Pocatello, ID, USA","ISU Symphony",208-234-1587,symphony@isu.edu,FREE
8320,"Green Book",2019-02-10,"7:00 pm",2019-02-10,,https://www.visitpocatello.com/events/green-book-2,,,,,$2-$3
8318,"Green Book",2019-02-10,"4:30 pm",2019-02-10,,https://www.visitpocatello.com/events/green-book,,"Pocatelllo Film Society",,,$2-$3
8314,"The Hate U Give",2019-01-27,"4:30 pm",2019-01-27,,https://www.visitpocatello.com/events/the-hate-u-give,,,,,$2-$3
8309,"Old Man &#038; the Gun &#8211; MOVIE",2019-01-20,"7:00 pm",2019-01-20,,https://www.visitpocatello.com/events/old-man-the-gun-movie-2,,,,,$2-$3
8307,"Old Man &#038; the Gun &#8211; MOVIE",2019-01-20,"4:30 pm",2019-01-20,,https://www.visitpocatello.com/events/old-man-the-gun-movie,,,,,$2-$3
8305,"Colette &#8211; MOVIE",2019-01-13,"7:00 pm",2019-01-13,,https://www.visitpocatello.com/events/colette-movie-2,,,,,$2-$3
8303,"Colette &#8211; MOVIE",2019-01-13,"4:30 pm",2019-01-13,,https://www.visitpocatello.com/events/colette-movie,"ISU Pond Student Union Building",,,,$2-$3
8273,"Pops Concert with Acoustic Eidolon",2019-03-15,"7:30 pm",2019-03-15,,https://www.visitpocatello.com/events/pops-concert-with-acoustic-eidolon,"Pocatello, ID, USA",,,,$13-$40
8268,"Pre-Concert Valentine Dinner",2019-02-08,"5:30 pm",2019-02-08,,https://www.visitpocatello.com/events/pre-concert-valentine-dinner,"1002 Sam Nixon Drive, Pocatello, ID, USA",,,,$45
8266,"Be My Valentine: An Evening of Jazz and Orchestra",2019-02-08,"7:30 pm",2019-02-08,,https://www.visitpocatello.com/events/be-my-valentine-an-evening-of-jazz-and-orchestra,"Pocatello, ID, USA",,,,$13-$40
7731,"The Comedy Project",2018-12-21,"8:00 pm",2018-12-21,"9:30 pm",https://www.visitpocatello.com/events/the-comedy-project,"MP Dance Studio, 575 E. 2nd Street, Pocatello ID","Visit Pocatello",,visitpocatello@gmail.com,
7374,"Zoo Boo, Zoo Idaho",2018-10-27,"10:00 am",2018-10-27,"3:00 pm",https://www.visitpocatello.com/events/zoo-boo-zoo-idaho,"2900 South 2nd Avenue Pocatello, Idaho  83204","Visit Pocatello",,visitpocatello@gmail.com,
5795,"Simplot Games",2019-02-14,"All of the day",2019-02-16,,https://www.visitpocatello.com/events/simplot-games,"ISU Holt Arena, Pocatello, ID, USA",,,,
5793,"Splash Dance",2018-07-26,"8:30 pm",2018-07-26,"10:30 pm",https://www.visitpocatello.com/events/splash-dance,"Ross Park Aquatic Complex, Pocatello, ID, USA",,,,
5776,"Christmas in Night Time Skies",2018-11-24,"5:00 pm",2018-11-24,"8:15 pm",https://www.visitpocatello.com/events/christmas-in-night-time-skies,"Bannock County Event Center, Fairgrounds, Pocatello, ID, USA",,,,
5774,"Pop-Up Chemistry",2018-07-20,"10:00 am",2018-07-20,"12:00 pm",https://www.visitpocatello.com/events/pop-up-chemistry,"Idaho Museum of Natural History, East Dillon Street, Pocatello, ID, USA",,,,
5766,"Free Mountain Bike Races-Ladies Only",2018-09-27,"6:30 pm",2018-09-27,"10:00 pm",https://www.visitpocatello.com/events/free-mountain-bike-races-ladies-only,"Centennial Park, Pocatello, ID, USA",,,,
5764,"Free Mountain Bike Races",2018-08-23,"6:30 pm",2018-07-23,"10:00 pm",https://www.visitpocatello.com/events/free-mountain-bike-races,"Centennial Park, Pocatello, ID, USA",,,,
5762,"The Simplot Run 2018",2018-09-08,"8:00 am",2018-09-08,"11:00 am",https://www.visitpocatello.com/events/the-simplot-run-2018,"Ross Park Aquatic Complex, Pocatello, ID, USA",,,,
5760,"Joint Jaunt",2018-08-11,"8:00 am",2018-08-11,"11:00 am",https://www.visitpocatello.com/events/joint-jaunt,"O.K. Ward Park / Brooklyn's Playground, Pocatello, ID, USA",,,,
5758,"Thor&#8217;s Trial Race",2018-09-29,"8:30 am",2018-09-29,"1:00 pm",https://www.visitpocatello.com/events/thors-trial-race,"East Mink Creek Nordic Center, South 2nd Avenue, Pocatello, ID, USA",,,,
5756,"Just Cuz Half Marathon",2018-10-13,"10:15 am",2018-10-13,,https://www.visitpocatello.com/events/just-cuz-half-marathon,"Centennial Park, Pocatello, ID, USA",,,,
5754,"Montana Shakespeare in the Park&#8217;s &#8220;Love&#8217;s Labour&#8217;s Lost&#8221;",2018-07-26,"6:30 pm",2018-07-26,"8:30 pm",https://www.visitpocatello.com/events/montana-shakespeare-in-the-parks-loves-labours-lost,"Idaho State University",,,,
5751,"Montana Shakespeare in the Park&#8217;s Othello",2018-07-25,"6:30 pm",2018-07-25,"8:30 pm",https://www.visitpocatello.com/events/montana-shakespeare-in-the-parks-othello,"Idaho State University",,,,Free
5742,"Pocatello Pump",2018-09-15,"8:00 am",2018-09-16,,https://www.visitpocatello.com/events/pocatello-pump,"Upper Ross Pavilion, Avenue of the Chiefs, Pocatello, ID, USA",,,,
5740,"Urban Invasion Obstable Challenge",2019-04-19,"8:00 am",2019-04-19,"12:00 pm",https://www.visitpocatello.com/events/urban-invasion-obstable-challenge,"Old Town Pocatello, 420 North Main Street, Pocatello, ID, USA",,,,
5738,"9th Annual Gate City Brewfest",2019-03-09,"1:00 pm",2019-03-09,"6:00 pm",https://www.visitpocatello.com/events/9th-annual-gate-city-brewfest,,,,,
5730,"1st Annual Neon Street Dance",2018-08-04,"6:00 pm",2018-08-04,"11:00 pm",https://www.visitpocatello.com/events/1st-annual-neon-street-dance,"Old Town Pocatello - East Center Street",,,,
5728,"Revive @ 5 Free Summer Concerts",2018-07-11,"5:00 pm",2018-08-29,"8:00 pm",https://www.visitpocatello.com/events/revive-5-free-summer-concerts,"Old Town Pocatello, 420 North Main Street, Pocatello, ID, USA",,,,Free
5720,"Brewfest 2",2018-09-08,"4:00 pm",2018-09-08,"9:00 pm",https://www.visitpocatello.com/events/brewfest-2,"Old Town Pocatello, 420 North Main Street, Pocatello, ID, USA",,,,
5716,"Portneuf Valley Farmers Market",2018-07-14,"9:00 am",2018-10-31,"1:00 pm",https://www.visitpocatello.com/events/portneuf-valley-farmers-market-2,"Old Town Pocatello, 420 North Main Street, Pocatello, ID, USA",,,,
5714,"Portneuf Valley Farmers Market",2018-07-11,"5:00 pm",2018-08-29,"8:00 pm",https://www.visitpocatello.com/events/portneuf-valley-farmers-market,"Old Town Pocatello, 420 North Main Street, Pocatello, ID, USA",,,,
5712,"Downtown Days Great Pumpkin Festival",2018-10-05,,2018-10-06,,https://www.visitpocatello.com/events/downtown-days-great-pumpkin-festival,"Old Town Pocatello, 420 North Main Street, Pocatello, ID, USA",,,,
5710,"10th Annual Haunted History Walking Tours",2018-10-13,"6:00 pm",2018-10-27,,https://www.visitpocatello.com/events/10th-annual-haunted-history-walking-tours,"Old Town Pocatello, 420 North Main Street, Pocatello, ID, USA",,,,
5702,"Movies in the Park",2018-07-14,"8:00 pm",2018-07-14,"10:00 pm",https://www.visitpocatello.com/events/movies-in-the-park,"Stuart Park, Chubbuck, ID, USA",,,,Free!
5700,"Idaho State University Homecoming",2018-09-24,"All of the day",2018-09-29,,https://www.visitpocatello.com/events/idaho-state-university-homecoming,"Idaho State University",,,,
5693,"55th Annual Shoshone-Bannock Indian Festival",2018-08-09,"All of the day",2018-08-12,,https://www.visitpocatello.com/events/55th-annual-shoshone-bannock-indian-festival,"Fort Hall Indian Reservation, ID, USA",,,,
5691,"Sagebrush Arts Festival",2018-10-24,"10:00 am",2018-10-25,"7:00 pm",https://www.visitpocatello.com/events/sagebrush-arts-festival,"Idaho State University",,,,
5689,"15th Annual Bannock County Bluegrass Festival",2018-08-17,"All of the day",2018-08-19,,https://www.visitpocatello.com/events/15th-annual-bannock-county-bluegrass-festival,"Bannock County Event Center, Fairgrounds, Pocatello, ID, USA",,,,
5687,"Art Walk",2019-01-04,"8:00 am",2019-01-04,"6:00 pm",https://www.visitpocatello.com/events/art-walk,"Old Town Pocatello, 420 North Main Street, Pocatello, ID, USA",,,,
5685,"Small Business Saturday",2018-11-24,"All of the day",2018-11-24,,https://www.visitpocatello.com/events/small-business-saturday,"Old Town Pocatello, 420 North Main Street, Pocatello, ID, USA",,,,
5683,"Night Lights Parade",2018-11-23,"6:30 pm",2018-11-23,,https://www.visitpocatello.com/events/night-lights-parade,"Old Town Pocatello, 420 North Main Street, Pocatello, ID, USA",,,,
5681,"Trick or Treat the Old Town Streets",2018-10-31,"3:00 pm",2018-10-31,"5:30 pm",https://www.visitpocatello.com/events/trick-or-treat-the-old-town-streets,"Old Town Pocatello, 420 North Main Street, Pocatello, ID, USA",,,,
5679,"Zoo Idaho Zoo Boo",2018-10-27,"10:00 am",2018-10-27,"3:00 pm",https://www.visitpocatello.com/events/zoo-idaho-zoo-boo,"Zoo Idaho, South 2nd Avenue, Pocatello, ID, USA",,,,
5677,"Ice Cream Zoofari",2018-08-18,"2:00 pm",2018-08-18,"4:00 pm",https://www.visitpocatello.com/events/ice-cream-zoofari,"Zoo Idaho, South 2nd Avenue, Pocatello, ID, USA",,,,
5673,"10th Annual Eastern Idaho Scottish Games",2018-08-11,"8:00 am",2018-08-11,"3:00 pm",https://www.visitpocatello.com/events/10th-annual-eastern-idaho-scottish-games,"Cotant Park, Chubbuck, ID, USA",,,,
5543,"Chubbuck Days Parade and Festival",2018-08-11,"10:00 am",2018-08-11,,https://www.visitpocatello.com/events/chubbuck-days-parade-and-festival,"Stuart Park, Chubbuck, ID, USA",,,,
1652,"&#8220;You Can&#8217;t Take It With You&#8221; by George S. Kaufman &#038; Moss Hart",2018-10-28,"12:00 am",2018-10-28,"12:00 am",https://www.visitpocatello.com/events/you-cant-take-it-with-you-by-george-s-kaufman-moss-hart-8,"The Warehouse 1009 S 2nd Ave. Pocatello, ID 83201",,,,
1651,"&#8220;You Can&#8217;t Take It With You&#8221; by George S. Kaufman &#038; Moss Hart",2018-10-27,"12:00 am",2018-10-27,"12:00 am",https://www.visitpocatello.com/events/you-cant-take-it-with-you-by-george-s-kaufman-moss-hart-7,"The Warehouse 1009 S 2nd Ave. Pocatello, ID 83201",,,,
1649,"&#8220;You Can&#8217;t Take It With You&#8221; by George S. Kaufman &#038; Moss Hart",2018-10-20,"12:00 am",2018-10-20,"12:00 am",https://www.visitpocatello.com/events/you-cant-take-it-with-you-by-george-s-kaufman-moss-hart-5,"The Warehouse 1009 S 2nd Ave. Pocatello, ID 83201",,,,
1648,"&#8220;You Can&#8217;t Take It With You&#8221; by George S. Kaufman &#038; Moss Hart",2018-10-14,"12:00 am",2018-10-14,"12:00 am",https://www.visitpocatello.com/events/you-cant-take-it-with-you-by-george-s-kaufman-moss-hart-4,"The Warehouse 1009 S 2nd Ave. Pocatello, ID 83201",,,,
1647,"&#8220;You Can&#8217;t Take It With You&#8221; by George S. Kaufman &#038; Moss Hart",2018-10-13,"12:00 am",2018-10-13,"12:00 am",https://www.visitpocatello.com/events/you-cant-take-it-with-you-by-george-s-kaufman-moss-hart-3,"The Warehouse 1009 S 2nd Ave. Pocatello, ID 83201",,,,
1646,"&#8220;You Can&#8217;t Take It With You&#8221; by George S. Kaufman &#038; Moss Hart",2018-10-07,"12:00 am",2018-10-07,"12:00 am",https://www.visitpocatello.com/events/you-cant-take-it-with-you-by-george-s-kaufman-moss-hart-2,"The Warehouse 1009 S 2nd Ave. Pocatello, ID 83201",,,,
1645,"&#8220;You Can&#8217;t Take It With You&#8221; by George S. Kaufman &#038; Moss Hart",2018-10-06,"12:00 am",2018-10-06,"12:00 am",https://www.visitpocatello.com/events/you-cant-take-it-with-you-by-george-s-kaufman-moss-hart,"The Warehouse 1009 S 2nd Ave. Pocatello, ID 83201",,,,
1644,"&#8220;Chiller Double Feature&#8221;",2018-07-29,"12:00 am",2018-07-29,"12:00 am",https://www.visitpocatello.com/events/chiller-double-feature-8,"The Warehouse 1009 S 2nd Ave. Pocatello, ID 83201",,,,
1643,"&#8220;Chiller Double Feature&#8221;",2018-07-28,"12:00 am",2018-07-28,"12:00 am",https://www.visitpocatello.com/events/chiller-double-feature-7,"The Warehouse 1009 S 2nd Ave. Pocatello, ID 83201",,,,
1642,"&#8220;Chiller Double Feature&#8221;",2018-07-22,"12:00 am",2018-07-22,"12:00 am",https://www.visitpocatello.com/events/chiller-double-feature-6,"The Warehouse 1009 S 2nd Ave. Pocatello, ID 83201",,,,
1641,"&#8220;Chiller Double Feature&#8221;",2018-07-21,"12:00 am",2018-07-21,"12:00 am",https://www.visitpocatello.com/events/chiller-double-feature-5,"The Warehouse 1009 S 2nd Ave. Pocatello, ID 83201",,,,
1640,"&#8220;Chiller Double Feature&#8221;",2018-07-15,"12:00 am",2018-07-15,"12:00 am",https://www.visitpocatello.com/events/chiller-double-feature-4,"The Warehouse 1009 S 2nd Ave. Pocatello, ID 83201",,,,
1639,"&#8220;Chiller Double Feature&#8221;",2018-07-14,"12:00 am",2018-07-14,"12:00 am",https://www.visitpocatello.com/events/chiller-double-feature-3,"The Warehouse 1009 S 2nd Ave. Pocatello, ID 83201",,,,
1638,"&#8220;Chiller Double Feature&#8221;",2018-07-09,"6:00 pm",2018-07-09,"11:00 pm",https://www.visitpocatello.com/events/chiller-double-feature-2,"The Warehouse 1009 S 2nd Ave. Pocatello, ID 83201",,,,
1627,"2018 Greek Festival",2018-08-25,"11:00 am",2018-08-26,"8:00 pm",https://www.visitpocatello.com/events/2018-greek-festival,"Assumption of the Blessed Virgin Mary Greek Orthodox Church pocatello",,,,
8316,"The Hate U Give",2019-01-27,"7:00 pm",2019-01-27,,https://www.visitpocatello.com/events/the-hate-u-give-2,,"Pocatello Film Society",,,$2-$3
